Target
Lysophosphatidic acid receptor 1
Ligand
BDBM50193515
Substrate
Meas. Tech.
ChEMBL_385201 (CHEMBL868013)
Ki
60.7±n/a nM
Citation
 Xu, YJiang, GTsukahara, RFujiwara, YTigyi, GPrestwich, GD Phosphonothioate and fluoromethylene phosphonate analogues of cyclic phosphatidic acid: Novel antagonists of lysophosphatidic acid receptors. J Med Chem 49:5309-15 (2006)  
Target
Name:
Lysophosphatidic acid receptor 1
Synonyms:
EDG2 LPA-1 LPAR1 Lysophosphatidic acid receptor 1 (LPA1) | Lysophosphatidic acid receptor Edg-2
Type:
Enzyme
Mol. Mass.:
41120.55
Organism:
Homo sapiens (Human)
Description:
Q92633
Residue:
364
  
Inhibitor
Name:
BDBM50193515
Synonyms:
1-fluoro-(3S)-hydroxyl-4-oleoyloxylbutane 1,3-cyclic phosphonate | CHEMBL210117
Type:
Small organic molecule
Emp. Form.:
C22H42FO5P
Mol. Mass.:
436.538
SMILES:
CCCCCCCCCCCCCCCCCC(=O)OC[C@@H]1CC(F)P(O)(=O)O1
: