Target
Dual specificity mitogen-activated protein kinase kinase 1
Ligand
BDBM50194044
Substrate
Meas. Tech.
ChEMBL_420097 (CHEMBL873739)
IC50
150±n/a nM
Citation
 El Abdellaoui, HVaraprasad, CVBarawkar, DChakravarty, SMaderna, ATam, RChen, HAllan, MWu, JZAppleby, TYan, SZhang, WLang, SYao, NHamatake, RHong, Z Identification of isothiazole-4-carboxamidines derivatives as a novel class of allosteric MEK1 inhibitors. Bioorg Med Chem Lett 16:5561-6 (2006)  
Target
Name:
Dual specificity mitogen-activated protein kinase kinase 1
Synonyms:
Dual specificity mitogen-activated protein kinase (MEK) Dual specificity mitogen-activated protein kinase kinase 1 (MEK1) Dual specificity mitogen-activated protein kinase kinase MEK1/2 MAP kinase kinase 1 MAPK/ERK kinase 1 MEK-1 MP2K1_HUMAN PRKMK1 | VHL-MAP2K1/MAP2K2
Type:
Other Protein Type
Mol. Mass.:
43439.03
Organism:
Homo sapiens (Human)
Description:
Full-length human MEK-1 was generated by PCR and purified as a fusion protein from Escherichia coli lysates.
Residue:
393
  
Inhibitor
Name:
BDBM50194044
Synonyms:
3-hydroxy-N-1-hydroxypropan-2-yl)-5-4-phenylsulfonyl)phenylamino)isothiazole-4-carboximidamide | CHEMBL217117
Type:
Small organic molecule
Emp. Form.:
C19H20N4O4S2
Mol. Mass.:
432.516
SMILES:
CC(CO)N=C(N)c1c(Nc2ccc(cc2)S(=O)(=O)c2ccccc2)s[nH]c1=O
: