Target
Delta-type opioid receptor
Ligand
BDBM50194233
Substrate
Meas. Tech.
ChEMBL_392436 (CHEMBL913211)
IC50
0.120000±n/a nM
Citation
 Thomas, JBZhang, LNavarro, HACarroll, FI Highly potent and selective phenylmorphan-based inverse agonists of the opioid delta receptor. J Med Chem 49:5597-609 (2006)  
Target
Name:
Delta-type opioid receptor
Synonyms:
D-OR-1 Delta opioid receptor OPIATE Delta OPRD1 OPRK1 | opioid receptor, delta 1
Type:
G Protein-Coupled Receptor (GPCR)
Mol. Mass.:
40382.98
Organism:
Homo sapiens (Human)
Description:
Competition binding assays were carried out using membrane preparations from transfected HN9.10 cells that constitutively expressed the delta opioid receptor.
Residue:
372
  
Inhibitor
Name:
BDBM50194233
Synonyms:
(+)-N-{(1S,4R,5R,7S)-5-(3-hydroxyphenyl)-4-methyl-2-[3-(2-methylphenyl)prop-2-en-1-yl]-2-azabicyclo[3.3.1]non-7-yl}-2-methyl-2-phenylpropanamide | CHEMBL386434
Type:
Small organic molecule
Emp. Form.:
C35H42N2O2
Mol. Mass.:
522.7202
SMILES:
C[C@H]1CN(C\C=C\c2ccccc2C)[C@@H]2C[C@H](C[C@]1(C2)c1cccc(O)c1)NC(=O)C(C)(C)c1ccccc1
: