Target
Neuromedin-K receptor
Ligand
BDBM50052524
Substrate
Meas. Tech.
ChEMBL_424431 (CHEMBL910710)
EC50
3±n/a nM
Citation
 Elliott, JMCarling, RWChicchi, GGCrawforth, JHutson, PHJones, ABKelly, SMarwood, RMeneses-Lorente, GMezzogori, EMurray, FRigby, MRoyo, IRussell, MGShaw, DSohal, BTsao, KLWilliams, B N',2-diphenylquinoline-4-carbohydrazide based NK3 receptor antagonists II. Bioorg Med Chem Lett 16:5752-6 (2006)  
Target
Name:
Neuromedin-K receptor
Synonyms:
NK-3 receptor NK3R NKR Neurokinin B receptor Neuromedin-3 receptor (NK-3R) Neuromedin-K receptor Neuromedin-K receptor (NK3) TAC3R Tachykinin receptor 3 | Tachykinin receptor 3 (NK3)
Type:
Enzyme
Mol. Mass.:
52221.96
Organism:
Homo sapiens (Human)
Description:
P29371
Residue:
465
  
Inhibitor
Name:
BDBM50052524
Synonyms:
(S)-N-((S)-1-{[(S)-1-({[(S)-1-((S)-1-Carbamoyl-3-methylsulfanyl-propylcarbamoyl)-3-methyl-butylcarbamoyl]-methyl}-carbamoyl)-2-phenyl-ethyl]-methyl-carbamoyl}-2-phenyl-ethyl)-3-(3-carboxy-propionylamino)-succinamic acid senktide
Type:
Small organic molecule
Emp. Form.:
C40H55N7O11S
Mol. Mass.:
841.97
SMILES:
CSCC[C@H](NC(=O)[C@H](CC(C)C)NC(=O)CNC(=O)[C@H](Cc1ccccc1)N(C)C(=O)[C@H](Cc1ccccc1)NC(=O)[C@H](CC(O)=O)NC(=O)CCC(O)=O)C(N)=O
: