Target
5-hydroxytryptamine receptor 2A
Ligand
BDBM50005267
Substrate
Meas. Tech.
ChEMBL_399259 (CHEMBL908600)
Ki
0.88±n/a nM
Citation
 McLean, THParrish, JCBraden, MRMarona-Lewicka, DGallardo-Godoy, ANichols, DE 1-Aminomethylbenzocycloalkanes: conformationally restricted hallucinogenic phenethylamine analogues as functionally selective 5-HT2A receptor agonists. J Med Chem 49:5794-803 (2006)  
Target
Name:
5-hydroxytryptamine receptor 2A
Synonyms:
5-HT-2A 5-HT2A 5-hydroxytryptamine receptor 2A (5HT2A) Htr2 Serotonin Receptor 2A
Type:
G Protein-Coupled Receptor (GPCR)
Mol. Mass.:
52852.05
Organism:
Rattus norvegicus (rat)
Description:
Rat cortex membranes 5-HT2A receptors.
Residue:
471
  
Inhibitor
Name:
BDBM50005267
Synonyms:
2,5-dimethoxy-4-bromophenethylamine 2-(4-bromo-2,5-dimethoxyphenyl)ethylamine | CHEMBL292821
Type:
Small organic molecule
Emp. Form.:
C10H14BrNO2
Mol. Mass.:
260.128
SMILES:
COc1cc(CCN)c(OC)cc1Br
: