Target
Peroxisome proliferator-activated receptor gamma
Ligand
BDBM50195085
Substrate
Meas. Tech.
ChEMBL_424736 (CHEMBL907888)
Ki
2300±n/a nM
Citation
 Humphries, PSAlmaden, JVBarnum, SJCarlson, TJDo, QQFraser, JDHess, MKim, YHOgilvie, KMSun, S Pyridine-2-propanoic acids: Discovery of dual PPARalpha/gamma agonists as antidiabetic agents. Bioorg Med Chem Lett 16:6116-9 (2006)  
Target
Name:
Peroxisome proliferator-activated receptor gamma
Synonyms:
NR1C3 PPAR-gamma PPARG_HUMAN Peroxisome proliferator-activated receptor gamma (PPAR gamma) Peroxisome proliferator-activated receptor gamma (PPARĪ³) peroxisome proliferator-activated receptor gamma isoform 2
Type:
Nuclear Receptor
Mol. Mass.:
57613.46
Organism:
Homo sapiens (Human)
Description:
P37231
Residue:
505
  
Inhibitor
Name:
BDBM50195085
Synonyms:
2-((2-(2-(5-methyl-2-phenyloxazol-4-yl)ethoxy)pyrimidin-5-yl)methyl)-tetrahydrofuran-2-carboxylic acid | CHEMBL385974
Type:
Small organic molecule
Emp. Form.:
C22H23N3O5
Mol. Mass.:
409.4351
SMILES:
Cc1oc(nc1CCOc1ncc(CC2(CCCO2)C(O)=O)cn1)-c1ccccc1
: