Target
Peroxisome proliferator-activated receptor gamma
Ligand
BDBM50195080
Substrate
Meas. Tech.
ChEMBL_424739 (CHEMBL907891)
EC50
130±n/a nM
Citation
 Humphries, PSAlmaden, JVBarnum, SJCarlson, TJDo, QQFraser, JDHess, MKim, YHOgilvie, KMSun, S Pyridine-2-propanoic acids: Discovery of dual PPARalpha/gamma agonists as antidiabetic agents. Bioorg Med Chem Lett 16:6116-9 (2006)  
Target
Name:
Peroxisome proliferator-activated receptor gamma
Synonyms:
NR1C3 PPAR-gamma PPARG_HUMAN Peroxisome proliferator-activated receptor gamma (PPAR gamma) Peroxisome proliferator-activated receptor gamma (PPARĪ³) peroxisome proliferator-activated receptor gamma isoform 2
Type:
Nuclear Receptor
Mol. Mass.:
57613.46
Organism:
Homo sapiens (Human)
Description:
P37231
Residue:
505
  
Inhibitor
Name:
BDBM50195080
Synonyms:
2-((5-(2-(2-(4-chlorophenyl)-5-methyloxazol-4-yl)ethoxy)pyridin-2-yl)methyl)-tetrahydrofuran-2-carboxylic acid | CHEMBL375370
Type:
Small organic molecule
Emp. Form.:
C23H23ClN2O5
Mol. Mass.:
442.892
SMILES:
Cc1oc(nc1CCOc1ccc(CC2(CCCO2)C(O)=O)nc1)-c1ccc(Cl)cc1
: