Target
11-beta-hydroxysteroid dehydrogenase 1
Ligand
BDBM50195481
Substrate
Meas. Tech.
ChEMBL_425005 (CHEMBL912530)
Ki
4±n/a nM
Citation
 Richards, SSorensen, BJae, HSWinn, MChen, YWang, JFung, SMonzon, KFrevert, EUJacobson, PSham, HLink, JT Discovery of potent and selective inhibitors of 11beta-HSD1 for the treatment of metabolic syndrome. Bioorg Med Chem Lett 16:6241-5 (2006)  
Target
Name:
11-beta-hydroxysteroid dehydrogenase 1
Synonyms:
11-DH 11-beta-Hydroxysteroid Dehydrogenase 1 (11-beta-HSD1) Corticosteroid 11-beta-dehydrogenase isozyme 1 DHI1_RAT Hsd11b1
Type:
Enzyme
Mol. Mass.:
31889.48
Organism:
Rattus norvegicus (rat)
Description:
P16232
Residue:
288
  
Inhibitor
Name:
BDBM50195481
Synonyms:
(1s,4s)-ethyl 4-(4-amino-3,5-dichloro-N-cyclopropylbenzamido)cyclohexanecarboxylate | CHEMBL376256
Type:
Small organic molecule
Emp. Form.:
C19H24Cl2N2O3
Mol. Mass.:
399.311
SMILES:
CCOC(=O)[C@@H]1CC[C@@H](CC1)N(C1CC1)C(=O)c1cc(Cl)c(N)c(Cl)c1
: