Target
11-beta-hydroxysteroid dehydrogenase 1
Ligand
BDBM50195489
Substrate
Meas. Tech.
ChEMBL_425005 (CHEMBL912530)
Ki
5.2±n/a nM
Citation
 Richards, SSorensen, BJae, HSWinn, MChen, YWang, JFung, SMonzon, KFrevert, EUJacobson, PSham, HLink, JT Discovery of potent and selective inhibitors of 11beta-HSD1 for the treatment of metabolic syndrome. Bioorg Med Chem Lett 16:6241-5 (2006)  
Target
Name:
11-beta-hydroxysteroid dehydrogenase 1
Synonyms:
11-DH 11-beta-Hydroxysteroid Dehydrogenase 1 (11-beta-HSD1) Corticosteroid 11-beta-dehydrogenase isozyme 1 DHI1_RAT Hsd11b1
Type:
Enzyme
Mol. Mass.:
31889.48
Organism:
Rattus norvegicus (rat)
Description:
P16232
Residue:
288
  
Inhibitor
Name:
BDBM50195489
Synonyms:
4-amino-3,5-dichloro-N-cyclopropyl-N-((1s,4s)-4-(pyrrolidine-1-carbonyl)cyclohexyl)benzamide | CHEMBL222256
Type:
Small organic molecule
Emp. Form.:
C21H27Cl2N3O2
Mol. Mass.:
424.364
SMILES:
Nc1c(Cl)cc(cc1Cl)C(=O)N(C1CC1)[C@H]1CC[C@H](CC1)C(=O)N1CCCC1
: