Target
11-beta-hydroxysteroid dehydrogenase 1
Ligand
BDBM50195497
Substrate
Meas. Tech.
ChEMBL_425005 (CHEMBL912530)
Ki
5±n/a nM
Citation
 Richards, SSorensen, BJae, HSWinn, MChen, YWang, JFung, SMonzon, KFrevert, EUJacobson, PSham, HLink, JT Discovery of potent and selective inhibitors of 11beta-HSD1 for the treatment of metabolic syndrome. Bioorg Med Chem Lett 16:6241-5 (2006)  
Target
Name:
11-beta-hydroxysteroid dehydrogenase 1
Synonyms:
11-DH 11-beta-Hydroxysteroid Dehydrogenase 1 (11-beta-HSD1) Corticosteroid 11-beta-dehydrogenase isozyme 1 DHI1_RAT Hsd11b1
Type:
Enzyme
Mol. Mass.:
31889.48
Organism:
Rattus norvegicus (rat)
Description:
P16232
Residue:
288
  
Inhibitor
Name:
BDBM50195497
Synonyms:
(4-amino-3,5-dichlorophenyl)((2R,6S)-4-(3-aminopyridin-2-yl)-2,6-dimethylpiperazin-1-yl)methanone | CHEMBL441553
Type:
Small organic molecule
Emp. Form.:
C18H21Cl2N5O
Mol. Mass.:
394.298
SMILES:
C[C@H]1CN(C[C@@H](C)N1C(=O)c1cc(Cl)c(N)c(Cl)c1)c1ncccc1N
: