Target
11-beta-hydroxysteroid dehydrogenase 1
Ligand
BDBM50195506
Substrate
Meas. Tech.
ChEMBL_425005 (CHEMBL912530)
Ki
4±n/a nM
Citation
 Richards, SSorensen, BJae, HSWinn, MChen, YWang, JFung, SMonzon, KFrevert, EUJacobson, PSham, HLink, JT Discovery of potent and selective inhibitors of 11beta-HSD1 for the treatment of metabolic syndrome. Bioorg Med Chem Lett 16:6241-5 (2006)  
Target
Name:
11-beta-hydroxysteroid dehydrogenase 1
Synonyms:
11-DH 11-beta-Hydroxysteroid Dehydrogenase 1 (11-beta-HSD1) Corticosteroid 11-beta-dehydrogenase isozyme 1 DHI1_RAT Hsd11b1
Type:
Enzyme
Mol. Mass.:
31889.48
Organism:
Rattus norvegicus (rat)
Description:
P16232
Residue:
288
  
Inhibitor
Name:
BDBM50195506
Synonyms:
(4-amino-3,5-dichloro-phenyl)-(2-aza-tricyclo[3.3.1.1*3,7*]dec-2-yl)-methanone | CHEMBL222938
Type:
Small organic molecule
Emp. Form.:
C16H18Cl2N2O
Mol. Mass.:
325.233
SMILES:
Nc1c(Cl)cc(cc1Cl)C(=O)N1C2CC3CC(C2)CC1C3
: