Target
Acetylcholinesterase
Ligand
BDBM10692
Substrate
Meas. Tech.
ChEMBL_431877 (CHEMBL915960)
IC50
0.3±n/a nM
Citation
 Piazzi, LBelluti, FBisi, AGobbi, SRizzo, SBartolini, MAndrisano, VRecanatini, MRampa, A Cholinesterase inhibitors: SAR and enzyme inhibitory activity of 3-[omega-(benzylmethylamino)alkoxy]xanthen-9-ones. Bioorg Med Chem 15:575-85 (2006)  
Target
Name:
Acetylcholinesterase
Synonyms:
ACES_HUMAN Acetylcholinesterase (AChE) | Acetylcholinesterase (human AChE)
Type:
Enzyme
Mol. Mass.:
67792.70
Organism:
Homo sapiens (Human)
Description:
P22303
Residue:
614
  
Inhibitor
Name:
BDBM10692
Synonyms:
3-{[methyl({3-[(9-oxo-9H-xanthen-3-yl)oxy]propyl})amino]methyl}phenyl N-methylcarbamate Xanthostigmine | aminoalkoxyheteroaryl deriv. 8
Type:
Small organic molecule
Emp. Form.:
C26H26N2O5
Mol. Mass.:
446.495
SMILES:
CNC(=O)Oc1cccc(CN(C)CCCOc2ccc3c(c2)oc2ccccc2c3=O)c1
: