Target
Transient receptor potential cation channel subfamily V member 1
Ligand
BDBM50196332
Substrate
Meas. Tech.
ChEMBL_453036 (CHEMBL902183)
Ki
232±n/a nM
Citation
 Kang, DWRyu, HLee, JLang, KAPavlyukovets, VAPearce, LVIkeda, TLazar, JBlumberg, PM Halogenation of 4-hydroxy-3-methoxybenzyl thiourea TRPV1 agonists showed enhanced antagonism to capsaicin. Bioorg Med Chem Lett 17:214-9 (2006)  
Target
Name:
Transient receptor potential cation channel subfamily V member 1
Synonyms:
Capsaicin receptor TRPV1_RAT Trpv1 Vanilloid VR1 Vanilloid receptor 1 (VRI/TRPV1) Vanilloid receptor type 1-like (TrpV1/Vr1) Vr1l | osm-9-like TRP channel 1
Type:
Transient Receptor
Mol. Mass.:
94956.12
Organism:
Rattus norvegicus (rat)
Description:
O35433
Residue:
838
  
Inhibitor
Name:
BDBM50196332
Synonyms:
2-((3-(4-hydroxy-3-iodo-5-methoxybenzyl)thioureido)methyl)-3-(3,4-dimethylphenyl)propyl pivalate | CHEMBL241686
Type:
Small organic molecule
Emp. Form.:
C26H35IN2O4S
Mol. Mass.:
598.537
SMILES:
COc1cc(CNC(=S)NCC(COC(=O)C(C)(C)C)Cc2ccc(C)c(C)c2)cc(I)c1O
: