Target
Adenosine receptor A2a
Ligand
BDBM50196543
Substrate
Meas. Tech.
ChEMBL_440720 (CHEMBL889817)
Ki
>5000±n/a nM
Citation
 Elzein, EKalla, RLi, XPerry, TMarquart, TMicklatcher, MLi, YWu, YZeng, DZablocki, J N6-Cycloalkyl-2-substituted adenosine derivatives as selective, high affinity adenosine A1 receptor agonists. Bioorg Med Chem Lett 17:161-6 (2006)  
Target
Name:
Adenosine receptor A2a
Synonyms:
A2A adenosine receptor (hA2A) ADENOSINE A2 ADORA2 Adenosine A2A receptor (A2AAR)
Type:
G Protein-Coupled Receptor (GPCR)
Mol. Mass.:
44716.46
Organism:
Homo sapiens (Human)
Description:
P29274
Residue:
412
  
Inhibitor
Name:
BDBM50196543
Synonyms:
1-(6-(bicyclo[2.2.1]heptan-1-ylamino)-9-((2R,3R,4S,5R)-3,4-dihydroxy-5-(hydroxymethyl)-tetrahydrofuran-2-yl)-9H-purin-2-yl)-1H-pyrazole-4-carboxylic acid | CHEMBL394221
Type:
Small organic molecule
Emp. Form.:
C21H25N7O6
Mol. Mass.:
471.4665
SMILES:
OC[C@H]1O[C@H]([C@H](O)[C@@H]1O)n1cnc2c(NC34CCC(CC3)C4)nc(nc12)-n1cc(cn1)C(O)=O
: