Target
Adenosine receptor A1
Ligand
BDBM50196555
Substrate
Meas. Tech.
ChEMBL_440718 (CHEMBL889815)
Ki
89±n/a nM
Citation
 Elzein, EKalla, RLi, XPerry, TMarquart, TMicklatcher, MLi, YWu, YZeng, DZablocki, J N6-Cycloalkyl-2-substituted adenosine derivatives as selective, high affinity adenosine A1 receptor agonists. Bioorg Med Chem Lett 17:161-6 (2006)  
Target
Name:
Adenosine receptor A1
Synonyms:
A1 adenosine receptor (hA1) AA1R_HUMAN ADORA1 Adenosine A1-receptor Adenosine receptor A1 (hA1) | Adenosine transporter (AdT)
Type:
G Protein-Coupled Receptor (GPCR)
Mol. Mass.:
36520.92
Organism:
Homo sapiens (Human)
Description:
P30542
Residue:
326
  
Inhibitor
Name:
BDBM50196555
Synonyms:
1-(9-((2R,3R,4S,5R)-3,4-dihydroxy-5-(hydroxymethyl)-tetrahydrofuran-2-yl)-6-(quinolin-2-ylamino)-9H-purin-2-yl)-N-ethyl-1H-pyrazole-4-carboxamide | CHEMBL232513
Type:
Small organic molecule
Emp. Form.:
C25H25N9O5
Mol. Mass.:
531.5233
SMILES:
CCNC(=O)c1cnn(c1)-c1nc(Nc2ccc3ccccc3n2)c2ncn([C@@H]3O[C@H](CO)[C@@H](O)[C@H]3O)c2n1
: