Target
Adenosine receptor A3
Ligand
BDBM50196567
Substrate
Meas. Tech.
ChEMBL_440719 (CHEMBL889816)
Ki
73±n/a nM
Citation
 Elzein, EKalla, RLi, XPerry, TMarquart, TMicklatcher, MLi, YWu, YZeng, DZablocki, J N6-Cycloalkyl-2-substituted adenosine derivatives as selective, high affinity adenosine A1 receptor agonists. Bioorg Med Chem Lett 17:161-6 (2006)  
Target
Name:
Adenosine receptor A3
Synonyms:
A3 adenosine receptor (hA3) ADORA3 | Adenosine A3 receptor (A3AR)
Type:
G Protein-Coupled Receptor (GPCR)
Mol. Mass.:
36197.32
Organism:
Homo sapiens (Human)
Description:
P0DMS8
Residue:
318
  
Inhibitor
Name:
BDBM50196567
Synonyms:
1-(9-((2R,3R,4S,5R)-3,4-dihydroxy-5-(hydroxymethyl)-tetrahydrofuran-2-yl)-6-(methylamino)-9H-purin-2-yl)-N-methyl-1H-pyrazole-4-carboxamide | CHEMBL234790
Type:
Small organic molecule
Emp. Form.:
C16H20N8O5
Mol. Mass.:
404.3806
SMILES:
CNC(=O)c1cnn(c1)-c1nc(NC)c2ncn([C@@H]3O[C@H](CO)[C@@H](O)[C@H]3O)c2n1
: