Target
Adenosine receptor A2a
Ligand
BDBM50196546
Substrate
Meas. Tech.
ChEMBL_440720 (CHEMBL889817)
Ki
>5000±n/a nM
Citation
 Elzein, EKalla, RLi, XPerry, TMarquart, TMicklatcher, MLi, YWu, YZeng, DZablocki, J N6-Cycloalkyl-2-substituted adenosine derivatives as selective, high affinity adenosine A1 receptor agonists. Bioorg Med Chem Lett 17:161-6 (2006)  
Target
Name:
Adenosine receptor A2a
Synonyms:
A2A adenosine receptor (hA2A) ADENOSINE A2 ADORA2 Adenosine A2A receptor (A2AAR)
Type:
G Protein-Coupled Receptor (GPCR)
Mol. Mass.:
44716.46
Organism:
Homo sapiens (Human)
Description:
P29274
Residue:
412
  
Inhibitor
Name:
BDBM50196546
Synonyms:
1-(6-(cyclopentylamino)-9-((2R,3R,4S,5R)-3,4-dihydroxy-5-(hydroxymethyl)-tetrahydrofuran-2-yl)-9H-purin-2-yl)-N-methyl-1H-pyrazole-4-carboxamide | CHEMBL400034
Type:
Small organic molecule
Emp. Form.:
C20H26N8O5
Mol. Mass.:
458.471
SMILES:
CNC(=O)c1cnn(c1)-c1nc(NC2CCCC2)c2ncn([C@@H]3O[C@H](CO)[C@@H](O)[C@H]3O)c2n1
: