Target
Adenosine receptor A1
Ligand
BDBM50196547
Substrate
Meas. Tech.
ChEMBL_440718 (CHEMBL889815)
Ki
31±n/a nM
Citation
 Elzein, EKalla, RLi, XPerry, TMarquart, TMicklatcher, MLi, YWu, YZeng, DZablocki, J N6-Cycloalkyl-2-substituted adenosine derivatives as selective, high affinity adenosine A1 receptor agonists. Bioorg Med Chem Lett 17:161-6 (2006)  
Target
Name:
Adenosine receptor A1
Synonyms:
A1 adenosine receptor (hA1) AA1R_HUMAN ADORA1 Adenosine A1-receptor Adenosine receptor A1 (hA1) | Adenosine transporter (AdT)
Type:
G Protein-Coupled Receptor (GPCR)
Mol. Mass.:
36520.92
Organism:
Homo sapiens (Human)
Description:
P30542
Residue:
326
  
Inhibitor
Name:
BDBM50196547
Synonyms:
(2R,3S,4R,5R)-2-(hydroxymethyl)-5-(2-(4-(hydroxymethyl)-1H-pyrazol-1-yl)-6-(4-(trifluoromethyl)phenylamino)-9H-purin-9-yl)-tetrahydrofuran-3,4-diol | CHEMBL392742
Type:
Small organic molecule
Emp. Form.:
C21H20F3N7O5
Mol. Mass.:
507.4226
SMILES:
OC[C@H]1O[C@H]([C@H](O)[C@@H]1O)n1cnc2c(Nc3ccc(cc3)C(F)(F)F)nc(nc12)-n1cc(CO)cn1
: