Target
Beta-secretase 1
Ligand
BDBM50196578
Substrate
Meas. Tech.
ChEMBL_458797 (CHEMBL942097)
IC50
500±n/a nM
Citation
 Freskos, JNFobian, YMBenson, TEBienkowski, MJBrown, DLEmmons, TLHeintz, RLaborde, AMcDonald, JJMischke, BVMolyneaux, JMMoon, JBMullins, PBBryan Prince, DPaddock, DJTomasselli, AGWinterrowd, G Design of potent inhibitors of human beta-secretase. Part 1. Bioorg Med Chem Lett 17:73-7 (2006)  
Target
Name:
Beta-secretase 1
Synonyms:
ASP2 Aspartyl protease 2 BACE1 Beta-secretase (BACE) Beta-secretase 1 (BACE 1) Beta-secretase 1 (BACE1) Beta-site amyloid precursor protein cleaving enzyme 1 Memapsin-2 beta-Secretase (BACE-1) | beta-Secretase (BACE1)
Type:
Protein
Mol. Mass.:
55755.10
Organism:
Homo sapiens (Human)
Description:
P56817
Residue:
501
  
Inhibitor
Name:
BDBM50196578
Synonyms:
3-[({(1S,2R)-1-BENZYL-2-HYDROXY-3-[(3-METHOXYBENZYL)AMINO]PROPYL}AMINO)(HYDROXY)METHYL]-N,N-DIPROPYLBENZAMIDE N1-((2S,3R)-4-(3-methoxybenzylamino)-3-hydroxy-1-phenylbutan-2-yl)-N3,N3-dipropylisophthalamide
Type:
Small organic molecule
Emp. Form.:
C32H41N3O4
Mol. Mass.:
531.6856
SMILES:
CCCN(CCC)C(=O)c1cccc(c1)C(=O)N[C@@H](Cc1ccccc1)[C@H](O)CNCc1cccc(OC)c1
: