Target
Beta-secretase 1
Ligand
BDBM15797
Substrate
Meas. Tech.
ChEMBL_458797 (CHEMBL942097)
IC50
5±n/a nM
Citation
 Freskos, JNFobian, YMBenson, TEBienkowski, MJBrown, DLEmmons, TLHeintz, RLaborde, AMcDonald, JJMischke, BVMolyneaux, JMMoon, JBMullins, PBBryan Prince, DPaddock, DJTomasselli, AGWinterrowd, G Design of potent inhibitors of human beta-secretase. Part 1. Bioorg Med Chem Lett 17:73-7 (2006)  
Target
Name:
Beta-secretase 1
Synonyms:
ASP2 Aspartyl protease 2 BACE1 Beta-secretase (BACE) Beta-secretase 1 (BACE 1) Beta-secretase 1 (BACE1) Beta-site amyloid precursor protein cleaving enzyme 1 Memapsin-2 beta-Secretase (BACE-1) | beta-Secretase (BACE1)
Type:
Protein
Mol. Mass.:
55755.10
Organism:
Homo sapiens (Human)
Description:
P56817
Residue:
501
  
Inhibitor
Name:
BDBM15797
Synonyms:
(1S,2R)-N-[1-(3,5-Difluorobenzyl)-2-hydroxy-3-(3-iodobenzylamino)-propyl]-5-methyl -N,N-dipropylisophthalamide CHEMBL373533 | hydroxyethyl secondary amine (HEA) inhibitor 6b
Type:
Small organic molecule
Emp. Form.:
C32H38F2IN3O3
Mol. Mass.:
677.5637
SMILES:
CCCN(CCC)C(=O)c1cc(C)cc(c1)C(=O)N[C@@H](Cc1cc(F)cc(F)c1)[C@H](O)CNCc1cccc(I)c1
: