Target
11-beta-hydroxysteroid dehydrogenase 1
Ligand
BDBM50197403
Substrate
Meas. Tech.
ChEMBL_453207 (CHEMBL902361)
Ki
3±n/a nM
Citation
 Sorensen, BWinn, MRohde, JShuai, QWang, JFung, SMonzon, KChiou, WStolarik, DImade, HPan, LDeng, XChovan, LLongenecker, KJudge, RQin, WBrune, MCamp, HFrevert, EUJacobson, PLink, JT Adamantane sulfone and sulfonamide 11-beta-HSD1 Inhibitors. Bioorg Med Chem Lett 17:527-32 (2007)  
Target
Name:
11-beta-hydroxysteroid dehydrogenase 1
Synonyms:
11-DH 11-beta-Hydroxysteroid Dehydrogenase 1 (11-beta-HSD1) 11beta-HSD1A Corticosteroid 11-beta-dehydrogenase isozyme 1 (11-beta-HSD-1) Hsd11 | Hsd11b1
Type:
Enzyme
Mol. Mass.:
32369.70
Organism:
Mus musculus (mouse)
Description:
P50172
Residue:
292
  
Inhibitor
Name:
BDBM50197403
Synonyms:
CHEMBL393167 | N-(5-methanesulfonyl-adamantan-2-yl)-2-methyl-2-(2-trifluoromethyl-phenoxy)-propionamide
Type:
Small organic molecule
Emp. Form.:
C22H28F3NO4S
Mol. Mass.:
459.522
SMILES:
CC(C)(Oc1ccccc1C(F)(F)F)C(=O)N[C@H]1C2CC3CC1C[C@](C3)(C2)S(C)(=O)=O
: