Target
Sphingosine 1-phosphate receptor 5
Ligand
BDBM50198836
Substrate
Meas. Tech.
ChEMBL_432839 (CHEMBL914107)
EC50
33±n/a nM
Citation
 Foss, FWSnyder, AHDavis, MDRouse, MOkusa, MDLynch, KRMacdonald, TL Synthesis and biological evaluation of gamma-aminophosphonates as potent, subtype-selective sphingosine 1-phosphate receptor agonists and antagonists. Bioorg Med Chem 15:663-77 (2006)  
Target
Name:
Sphingosine 1-phosphate receptor 5
Synonyms:
EDG8 S1P5 S1PR5_HUMAN Sphingosine 1-phosphate receptor Edg-8
Type:
G Protein-Coupled Receptor (GPCR)
Mol. Mass.:
41796.42
Organism:
Homo sapiens (Human)
Description:
Residue:
398
  
Inhibitor
Name:
BDBM50198836
Synonyms:
CHEMBL389033 | [3-amino-3-(3-octylphenylcarbamoyl)propyl]-phosphonic acid
Type:
Small organic molecule
Emp. Form.:
C18H31N2O4P
Mol. Mass.:
370.4235
SMILES:
CCCCCCCCc1cccc(NC(=O)[C@H](N)CCP(O)(O)=O)c1
: