Target
Sphingosine 1-phosphate receptor 3
Ligand
BDBM50198836
Substrate
Meas. Tech.
ChEMBL_432846 (CHEMBL915595)
Ki
300±n/a nM
Citation
 Foss, FWSnyder, AHDavis, MDRouse, MOkusa, MDLynch, KRMacdonald, TL Synthesis and biological evaluation of gamma-aminophosphonates as potent, subtype-selective sphingosine 1-phosphate receptor agonists and antagonists. Bioorg Med Chem 15:663-77 (2006)  
Target
Name:
Sphingosine 1-phosphate receptor 3
Synonyms:
C9orf108 EDG3 S1P receptor 3 S1P3 S1PR3_HUMAN Sphingosine 1-phosphate receptor 3 (S1P3) | Sphingosine 1-phosphate receptor Edg-3
Type:
G Protein-Coupled Receptor (GPCR)
Mol. Mass.:
42278.13
Organism:
Homo sapiens (Human)
Description:
Q99500
Residue:
378
  
Inhibitor
Name:
BDBM50198836
Synonyms:
CHEMBL389033 | [3-amino-3-(3-octylphenylcarbamoyl)propyl]-phosphonic acid
Type:
Small organic molecule
Emp. Form.:
C18H31N2O4P
Mol. Mass.:
370.4235
SMILES:
CCCCCCCCc1cccc(NC(=O)[C@H](N)CCP(O)(O)=O)c1
: