Target
Sphingosine 1-phosphate receptor 1
Ligand
BDBM50198836
Substrate
Meas. Tech.
ChEMBL_432845 (CHEMBL915594)
Ki
30±n/a nM
Citation
 Foss, FWSnyder, AHDavis, MDRouse, MOkusa, MDLynch, KRMacdonald, TL Synthesis and biological evaluation of gamma-aminophosphonates as potent, subtype-selective sphingosine 1-phosphate receptor agonists and antagonists. Bioorg Med Chem 15:663-77 (2006)  
Target
Name:
Sphingosine 1-phosphate receptor 1
Synonyms:
CHEDG1 Endothelial differentiation G-protein coupled receptor 1 S1P1 S1PR1_HUMAN Sphingosine 1-phosphate receptor Edg-1
Type:
Enzyme
Mol. Mass.:
42836.02
Organism:
Homo sapiens (Human)
Description:
P21453
Residue:
382
  
Inhibitor
Name:
BDBM50198836
Synonyms:
CHEMBL389033 | [3-amino-3-(3-octylphenylcarbamoyl)propyl]-phosphonic acid
Type:
Small organic molecule
Emp. Form.:
C18H31N2O4P
Mol. Mass.:
370.4235
SMILES:
CCCCCCCCc1cccc(NC(=O)[C@H](N)CCP(O)(O)=O)c1
: