Target
Sodium-dependent dopamine transporter
Ligand
BDBM22199
Substrate
Meas. Tech.
ChEMBL_458901 (CHEMBL923872)
Ki
0.9±n/a nM
Citation
 Gilbert, KMBoos, TLDersch, CMGreiner, EJacobson, AELewis, DMatecka, DPrisinzano, TEZhang, YRothman, RBRice, KCVenanzi, CA DAT/SERT selectivity of flexible GBR 12909 analogs modeled using 3D-QSAR methods. Bioorg Med Chem 15:1146-59 (2006)  
Target
Name:
Sodium-dependent dopamine transporter
Synonyms:
DA transporter SC6A3_RAT Sodium-dependent dopamine transporter | Sodium-dependent dopamine transporter (DAT)
Type:
Multi-pass membrane protein
Mol. Mass.:
68749.45
Organism:
Rattus norvegicus (rat)
Description:
P23977
Residue:
619
  
Inhibitor
Name:
BDBM22199
Synonyms:
1-{2-[bis(4-fluorophenyl)methoxy]ethyl}-4-[(2E)-3-phenylprop-2-en-1-yl]piperazine CHEMBL286991 GBR-13,069
Type:
Small organic molecule
Emp. Form.:
C28H30F2N2O
Mol. Mass.:
448.5474
SMILES:
Fc1ccc(cc1)C(OCCN1CCN(C\C=C\c2ccccc2)CC1)c1ccc(F)cc1
: