Target
Sodium-dependent dopamine transporter
Ligand
BDBM50183539
Substrate
Meas. Tech.
ChEMBL_458901 (CHEMBL923872)
Ki
0.8±n/a nM
Citation
 Gilbert, KMBoos, TLDersch, CMGreiner, EJacobson, AELewis, DMatecka, DPrisinzano, TEZhang, YRothman, RBRice, KCVenanzi, CA DAT/SERT selectivity of flexible GBR 12909 analogs modeled using 3D-QSAR methods. Bioorg Med Chem 15:1146-59 (2006)  
Target
Name:
Sodium-dependent dopamine transporter
Synonyms:
DA transporter SC6A3_RAT Sodium-dependent dopamine transporter | Sodium-dependent dopamine transporter (DAT)
Type:
Multi-pass membrane protein
Mol. Mass.:
68749.45
Organism:
Rattus norvegicus (rat)
Description:
P23977
Residue:
619
  
Inhibitor
Name:
BDBM50183539
Synonyms:
CHEMBL381256 trans-(R,R)-4-[2-[bis-(4-fluorophenyl)methoxy]ethyl]-1-(2-phenyl-cyclopropylmethyl)-piperidine oxalate
Type:
Small organic molecule
Emp. Form.:
C30H33F2NO
Mol. Mass.:
461.5859
SMILES:
Fc1ccc(cc1)C(OCCC1CCN(C[C@@H]2C[C@H]2c2ccccc2)CC1)c1ccc(F)cc1
: