Target
Sodium-dependent dopamine transporter
Ligand
BDBM50126823
Substrate
Meas. Tech.
ChEMBL_458901 (CHEMBL923872)
Ki
1.1±n/a nM
Citation
 Gilbert, KMBoos, TLDersch, CMGreiner, EJacobson, AELewis, DMatecka, DPrisinzano, TEZhang, YRothman, RBRice, KCVenanzi, CA DAT/SERT selectivity of flexible GBR 12909 analogs modeled using 3D-QSAR methods. Bioorg Med Chem 15:1146-59 (2006)  
Target
Name:
Sodium-dependent dopamine transporter
Synonyms:
DA transporter SC6A3_RAT Sodium-dependent dopamine transporter | Sodium-dependent dopamine transporter (DAT)
Type:
Multi-pass membrane protein
Mol. Mass.:
68749.45
Organism:
Rattus norvegicus (rat)
Description:
P23977
Residue:
619
  
Inhibitor
Name:
BDBM50126823
Synonyms:
1-(4-bromobenzyl)-4-(2-(bis(4-fluorophenyl)methoxy)ethyl)piperidine CHEMBL409161
Type:
Small organic molecule
Emp. Form.:
C27H28BrF2NO
Mol. Mass.:
500.418
SMILES:
Fc1ccc(cc1)C(OCCC1CCN(Cc2ccc(Br)cc2)CC1)c1ccc(F)cc1
: