Target
Sodium-dependent dopamine transporter
Ligand
BDBM50126386
Substrate
Meas. Tech.
ChEMBL_458901 (CHEMBL923872)
Ki
1.3±n/a nM
Citation
 Gilbert, KMBoos, TLDersch, CMGreiner, EJacobson, AELewis, DMatecka, DPrisinzano, TEZhang, YRothman, RBRice, KCVenanzi, CA DAT/SERT selectivity of flexible GBR 12909 analogs modeled using 3D-QSAR methods. Bioorg Med Chem 15:1146-59 (2006)  
Target
Name:
Sodium-dependent dopamine transporter
Synonyms:
DA transporter SC6A3_RAT Sodium-dependent dopamine transporter | Sodium-dependent dopamine transporter (DAT)
Type:
Multi-pass membrane protein
Mol. Mass.:
68749.45
Organism:
Rattus norvegicus (rat)
Description:
P23977
Residue:
619
  
Inhibitor
Name:
BDBM50126386
Synonyms:
(1R,2S)-2-((4-(2-(bis(4-fluorophenyl)methoxy)ethyl)piperazin-1-yl)methyl)-1,2,3,4-tetrahydronaphthalen-1-ol CHEMBL28660
Type:
Small organic molecule
Emp. Form.:
C30H34F2N2O2
Mol. Mass.:
492.6
SMILES:
O[C@@H]1[C@H](CN2CCN(CCOC(c3ccc(F)cc3)c3ccc(F)cc3)CC2)CCc2ccccc12
: