Target
Peroxisome proliferator-activated receptor gamma
Ligand
BDBM50199773
Substrate
Meas. Tech.
ChEMBL_453571 (CHEMBL885571)
EC50
304±n/a nM
Citation
 Gonzalez, ICLamar, JIradier, FXu, YWinneroski, LLYork, JYumibe, NZink, RMontrose-Rafizadeh, CEtgen, GJBroderick, CLOldham, BAMantlo, N Design and synthesis of a novel class of dual PPARgamma/delta agonists. Bioorg Med Chem Lett 17:1052-5 (2007)  
Target
Name:
Peroxisome proliferator-activated receptor gamma
Synonyms:
NR1C3 PPAR-gamma PPARG_HUMAN Peroxisome proliferator-activated receptor gamma (PPAR gamma) Peroxisome proliferator-activated receptor gamma (PPARĪ³) peroxisome proliferator-activated receptor gamma isoform 2
Type:
Nuclear Receptor
Mol. Mass.:
57613.46
Organism:
Homo sapiens (Human)
Description:
P37231
Residue:
505
  
Inhibitor
Name:
BDBM50199773
Synonyms:
3-(4-((R)-3-(4-chloro-2-(pyridin-2-yl)phenoxy)butoxy)-2-methylphenyl)propanoic acid | CHEMBL241299
Type:
Small organic molecule
Emp. Form.:
C25H26ClNO4
Mol. Mass.:
439.931
SMILES:
C[C@H](CCOc1ccc(CCC(O)=O)c(C)c1)Oc1ccc(Cl)cc1-c1ccccn1
: