Target
Peroxisome proliferator-activated receptor delta
Ligand
BDBM50199773
Substrate
Meas. Tech.
ChEMBL_453570 (CHEMBL885570)
EC50
24±n/a nM
Citation
 Gonzalez, ICLamar, JIradier, FXu, YWinneroski, LLYork, JYumibe, NZink, RMontrose-Rafizadeh, CEtgen, GJBroderick, CLOldham, BAMantlo, N Design and synthesis of a novel class of dual PPARgamma/delta agonists. Bioorg Med Chem Lett 17:1052-5 (2007)  
Target
Name:
Peroxisome proliferator-activated receptor delta
Synonyms:
NR1C2 NUCI Nuclear receptor subfamily 1 group C member 2 PPAR-beta PPARD Peroxisome proliferator-activated receptor Peroxisome proliferator-activated receptor delta
Type:
Enzyme
Mol. Mass.:
49910.45
Organism:
Homo sapiens (Human)
Description:
Q03181
Residue:
441
  
Inhibitor
Name:
BDBM50199773
Synonyms:
3-(4-((R)-3-(4-chloro-2-(pyridin-2-yl)phenoxy)butoxy)-2-methylphenyl)propanoic acid | CHEMBL241299
Type:
Small organic molecule
Emp. Form.:
C25H26ClNO4
Mol. Mass.:
439.931
SMILES:
C[C@H](CCOc1ccc(CCC(O)=O)c(C)c1)Oc1ccc(Cl)cc1-c1ccccn1
: