Target
Histamine H3 receptor
Ligand
BDBM50200642
Substrate
Meas. Tech.
ChEMBL_453775 (CHEMBL885776)
Ki
3.47±n/a nM
Citation
 Black, LANersesian, DLSharma, PKu, YYBennani, YLMarsh, KCMiller, TREsbenshade, TAHancock, AACowart, M 4-[6-(2-Aminoethyl)naphthalen-2-yl]benzonitriles are potent histamine H3 receptor antagonists with high CNS penetration. Bioorg Med Chem Lett 17:1443-6 (2007)  
Target
Name:
Histamine H3 receptor
Synonyms:
HH3R Hrh3
Type:
G Protein-Coupled Receptor (GPCR)
Mol. Mass.:
48607.98
Organism:
Rattus norvegicus (rat)
Description:
Residue:
445
  
Inhibitor
Name:
BDBM50200642
Synonyms:
(S)-4-(6-(2-(2-methylpyrrolidin-1-yl)ethyl)naphthalen-2-yl)benzonitrile | CHEMBL247505
Type:
Small organic molecule
Emp. Form.:
C24H24N2
Mol. Mass.:
340.4608
SMILES:
C[C@H]1CCCN1CCc1ccc2cc(ccc2c1)-c1ccc(cc1)C#N
: