Target
Acetylcholinesterase
Ligand
BDBM50201170
Substrate
Meas. Tech.
ChEMBL_441415 (CHEMBL891644)
IC50
7000±n/a nM
Citation
 Choo, CYHirasawa, YKarimata, CKoyama, KSekiguchi, MKobayashi, JMorita, H Carinatumins A-C, new alkaloids from Lycopodium carinatum inhibiting acetylcholinesterase. Bioorg Med Chem 15:1703-7 (2007)  
Target
Name:
Acetylcholinesterase
Synonyms:
ACES_BOVIN Acetylcholinesterase (AChE) | Acetylcholinesterase precursor
Type:
Enzyme
Mol. Mass.:
67659.62
Organism:
Bos taurus (bovine)
Description:
Residue:
613
  
Inhibitor
Name:
BDBM50201170
Synonyms:
CHEMBL241838 | carinatumins B (2)
Type:
Small organic molecule
Emp. Form.:
C16H20N2O2
Mol. Mass.:
272.3422
SMILES:
CC1=C[C@H]2Cc3[nH]c(=O)ccc3[C@]3(C1)NCC[C@@H](O)[C@H]23
: