Target
Muscarinic acetylcholine receptor M3
Ligand
BDBM50165019
Substrate
Meas. Tech.
ChEMBL_441418 (CHEMBL891647)
Ki
0.78±n/a nM
Citation
 Sonda, SKatayama, KFujio, MSakashita, HInaba, KAsano, KAkira, T 1,5-Benzodioxepin derivatives as a novel class of muscarinic M3 receptor antagonists. Bioorg Med Chem Lett 17:925-31 (2007)  
Target
Name:
Muscarinic acetylcholine receptor M3
Synonyms:
ACM3_HUMAN Cholinergic, muscarinic M3 Muscarinic receptor M3 | RecName: Full=Muscarinic acetylcholine receptor M3
Type:
Enzyme
Mol. Mass.:
66151.03
Organism:
Homo sapiens (Human)
Description:
P20309
Residue:
590
  
Inhibitor
Name:
BDBM50165019
Synonyms:
4-(Diethylamino)-2-butynyl alpha-phenylcyclohexaneglycolic acid ester 4-Diethylamino-2-butinyl alpha-cyclohexylmandelat Benzeneacetic acid, alpha-cyclohexyl-alpha-hydroxy-, 4-(diethylamino)-2-butynyl ester Cyclohexaneglycolic acid, alpha-phenyl-, 4-(diethylamino)-2-butynyl ester | OXYBUTYNIN CHLORIDE
Type:
Small organic molecule
Emp. Form.:
C22H31NO3
Mol. Mass.:
357.4864
SMILES:
CCN(CC)CC#CCOC(=O)C(O)(C1CCCCC1)c1ccccc1
: