Target
Vasopressin V1a receptor
Ligand
BDBM50202918
Substrate
Meas. Tech.
ChEMBL_441650 (CHEMBL891881)
Ki
0.2±n/a nM
Citation
 Guillon, CDKoppel, GABrownstein, MJChaney, MOFerris, CFLu, SFFabio, KMMiller, MJHeindel, NDHunden, DCCooper, RDKaldor, SWSkelton, JJDressman, BAClay, MPSteinberg, MIBruns, RFSimon, NG Azetidinones as vasopressin V1a antagonists. Bioorg Med Chem 15:2054-80 (2007)  
Target
Name:
Vasopressin V1a receptor
Synonyms:
AVPR V1a AVPR1A V1AR_HUMAN VASOPRESSIN V1A Vasopressin V1 receptor Vasopressin receptor
Type:
Receptor
Mol. Mass.:
46820.18
Organism:
Homo sapiens (Human)
Description:
P37288
Residue:
418
  
Inhibitor
Name:
BDBM50202918
Synonyms:
(S)-N-(2-fluoro-3-(trifluoromethyl)benzyl)-5-(4-cyclohexylpiperazin-1-yl)-5-oxo-2-((3S,4R)-2-oxo-3-((S)-2-oxo-4-phenyloxazolidin-3-yl)-4-((E)-styryl)azetidin-1-yl)pentanamide | CHEMBL397179
Type:
Small organic molecule
Emp. Form.:
C43H47F4N5O5
Mol. Mass.:
789.8574
SMILES:
Fc1c(CNC(=O)[C@H](CCC(=O)N2CCN(CC2)C2CCCCC2)N2[C@H](\C=C\c3ccccc3)[C@H](N3[C@H](COC3=O)c3ccccc3)C2=O)cccc1C(F)(F)F
: