Target
Proto-oncogene tyrosine-protein kinase Src
Ligand
BDBM50203074
Substrate
Meas. Tech.
ChEMBL_454144 (CHEMBL903333)
IC50
463±n/a nM
Citation
 Tripathy, RGhose, ASingh, JBacon, ERAngeles, TSYang, SXAlbom, MSAimone, LDHerman, JLMallamo, JP 1,2,3-Thiadiazole substituted pyrazolones as potent KDR/VEGFR-2 kinase inhibitors. Bioorg Med Chem Lett 17:1793-8 (2007)  
Target
Name:
Proto-oncogene tyrosine-protein kinase Src
Synonyms:
Calmodulin/Proto-oncogene tyrosine-protein kinase Src Proto-oncogene c-Src SRC SRC_HUMAN V-src sarcoma (Schmidt-Ruppin A-2) viral oncogene homolog (avian) p60-Src | pp60c-src
Type:
Protein
Mol. Mass.:
59838.60
Organism:
Homo sapiens (Human)
Description:
P12931
Residue:
536
  
Inhibitor
Name:
BDBM50203074
Synonyms:
4-((4-ethoxy-1-methyl-1H-indol-3-yl)methylene)-3-(4-methyl-1,2,3-thiadiazol-5-yl)-1H-pyrazol-5(4H)-one | CHEMBL398610
Type:
Small organic molecule
Emp. Form.:
C18H17N5O2S
Mol. Mass.:
367.425
SMILES:
CCOc1cccc2n(C)cc(C=c3c(=O)[nH][nH]\c3=c3/snnc3=C)c12
: