Target
Vascular endothelial growth factor receptor 2
Ligand
BDBM50203076
Substrate
Meas. Tech.
ChEMBL_454132 (CHEMBL903321)
IC50
174±n/a nM
Citation
 Tripathy, RGhose, ASingh, JBacon, ERAngeles, TSYang, SXAlbom, MSAimone, LDHerman, JLMallamo, JP 1,2,3-Thiadiazole substituted pyrazolones as potent KDR/VEGFR-2 kinase inhibitors. Bioorg Med Chem Lett 17:1793-8 (2007)  
Target
Name:
Vascular endothelial growth factor receptor 2
Synonyms:
CD_antigen=CD309 Fetal liver kinase 1 (FLK-1) KDR Protein-tyrosine kinase receptor Flk-1 VEGFR-2 VEGFR2 Vascular Endothelial Growth Factor Receptor Kinase 2 Vascular endothelial growth factor receptor 2 (KDR) Vascular endothelial growth factor receptor 2 (VEGFR2) Vascular endothelial growth factor receptor-2 (VEGFR-2)
Type:
Receptor Tyrosine Kinase
Mol. Mass.:
151510.97
Organism:
Homo sapiens (Human)
Description:
P35968
Residue:
1356
  
Inhibitor
Name:
BDBM50203076
Synonyms:
1-methyl-3-((5-oxo-3-(1,2,3-thiadiazol-5-yl)-1H-pyrazol-4(5H)-ylidene)methyl)-1H-indole-5-carbonitrile | CHEMBL249176
Type:
Small organic molecule
Emp. Form.:
C16H10N6OS
Mol. Mass.:
334.355
SMILES:
Cn1cc(\C=C2/C(=O)NN=C2c2cnns2)c2cc(ccc12)C#N
: