Target
High affinity nerve growth factor receptor
Ligand
BDBM50203074
Substrate
Meas. Tech.
ChEMBL_454147 (CHEMBL903336)
IC50
36±n/a nM
Citation
 Tripathy, RGhose, ASingh, JBacon, ERAngeles, TSYang, SXAlbom, MSAimone, LDHerman, JLMallamo, JP 1,2,3-Thiadiazole substituted pyrazolones as potent KDR/VEGFR-2 kinase inhibitors. Bioorg Med Chem Lett 17:1793-8 (2007)  
Target
Name:
High affinity nerve growth factor receptor
Synonyms:
2.7.10.1 NTRK1 NTRK1_HUMAN Neurotrophic tyrosine kinase receptor type 1 Synonyms=MTC TRK1-transforming tyrosine kinase protein TRKA GN Trk-A Tropomyosin-related kinase A Tyrosine kinase receptor Tyrosine kinase receptor A Tyrosine kinase receptor A (Trk-A) gp140trk | p140-TrkA
Type:
Mol. Mass.:
87498.18
Organism:
Homo sapiens (Human)
Description:
P04629
Residue:
796
  
Inhibitor
Name:
BDBM50203074
Synonyms:
4-((4-ethoxy-1-methyl-1H-indol-3-yl)methylene)-3-(4-methyl-1,2,3-thiadiazol-5-yl)-1H-pyrazol-5(4H)-one | CHEMBL398610
Type:
Small organic molecule
Emp. Form.:
C18H17N5O2S
Mol. Mass.:
367.425
SMILES:
CCOc1cccc2n(C)cc(C=c3c(=O)[nH][nH]\c3=c3/snnc3=C)c12
: