Target
Receptor-type tyrosine-protein kinase FLT3
Ligand
BDBM50203074
Substrate
Meas. Tech.
ChEMBL_454148 (CHEMBL903337)
IC50
19±n/a nM
Citation
 Tripathy, RGhose, ASingh, JBacon, ERAngeles, TSYang, SXAlbom, MSAimone, LDHerman, JLMallamo, JP 1,2,3-Thiadiazole substituted pyrazolones as potent KDR/VEGFR-2 kinase inhibitors. Bioorg Med Chem Lett 17:1793-8 (2007)  
Target
Name:
Receptor-type tyrosine-protein kinase FLT3
Synonyms:
CD135 FL cytokine receptor FLK2 FLT3 Fetal liver kinase-2 Fms-like tyrosine kinase 3 (Flt-3) STK-1 Stem cell tyrosine kinase 1
Type:
Enzyme
Mol. Mass.:
112888.62
Organism:
Homo sapiens (Human)
Description:
P36888
Residue:
993
  
Inhibitor
Name:
BDBM50203074
Synonyms:
4-((4-ethoxy-1-methyl-1H-indol-3-yl)methylene)-3-(4-methyl-1,2,3-thiadiazol-5-yl)-1H-pyrazol-5(4H)-one | CHEMBL398610
Type:
Small organic molecule
Emp. Form.:
C18H17N5O2S
Mol. Mass.:
367.425
SMILES:
CCOc1cccc2n(C)cc(C=c3c(=O)[nH][nH]\c3=c3/snnc3=C)c12
: