Target
Vascular endothelial growth factor receptor 2
Ligand
BDBM50203096
Substrate
Meas. Tech.
ChEMBL_454132 (CHEMBL903321)
IC50
89±n/a nM
Citation
 Tripathy, RGhose, ASingh, JBacon, ERAngeles, TSYang, SXAlbom, MSAimone, LDHerman, JLMallamo, JP 1,2,3-Thiadiazole substituted pyrazolones as potent KDR/VEGFR-2 kinase inhibitors. Bioorg Med Chem Lett 17:1793-8 (2007)  
Target
Name:
Vascular endothelial growth factor receptor 2
Synonyms:
CD_antigen=CD309 Fetal liver kinase 1 (FLK-1) KDR Protein-tyrosine kinase receptor Flk-1 VEGFR-2 VEGFR2 Vascular Endothelial Growth Factor Receptor Kinase 2 Vascular endothelial growth factor receptor 2 (KDR) Vascular endothelial growth factor receptor 2 (VEGFR2) Vascular endothelial growth factor receptor-2 (VEGFR-2)
Type:
Receptor Tyrosine Kinase
Mol. Mass.:
151510.97
Organism:
Homo sapiens (Human)
Description:
P35968
Residue:
1356
  
Inhibitor
Name:
BDBM50203096
Synonyms:
4-((4-bromo-1-methyl-1H-indol-3-yl)methylene)-3-(4-phenyl-1,2,3-thiadiazol-5-yl)-1H-pyrazol-5(4H)-one | CHEMBL400398
Type:
Small organic molecule
Emp. Form.:
C21H14BrN5OS
Mol. Mass.:
464.338
SMILES:
Cn1cc(\C=C2/C(=O)NN=C2c2snnc2-c2ccccc2)c2c(Br)cccc12
: