Target
Angiopoietin-1 receptor
Ligand
BDBM50203074
Substrate
Meas. Tech.
ChEMBL_454145 (CHEMBL903334)
IC50
>10000±n/a nM
Citation
 Tripathy, RGhose, ASingh, JBacon, ERAngeles, TSYang, SXAlbom, MSAimone, LDHerman, JLMallamo, JP 1,2,3-Thiadiazole substituted pyrazolones as potent KDR/VEGFR-2 kinase inhibitors. Bioorg Med Chem Lett 17:1793-8 (2007)  
Target
Name:
Angiopoietin-1 receptor
Synonyms:
TEK TIE2_HUMAN Tyrosine-protein kinase receptor (TIE-2) Tyrosine-protein kinase receptor TEK (p140 TEK) Tyrosine-protein kinase receptor TIE2/TEK VMCM1 p140 TEK
Type:
Enzyme
Mol. Mass.:
125835.70
Organism:
Homo sapiens (Human)
Description:
Q02763
Residue:
1124
  
Inhibitor
Name:
BDBM50203074
Synonyms:
4-((4-ethoxy-1-methyl-1H-indol-3-yl)methylene)-3-(4-methyl-1,2,3-thiadiazol-5-yl)-1H-pyrazol-5(4H)-one | CHEMBL398610
Type:
Small organic molecule
Emp. Form.:
C18H17N5O2S
Mol. Mass.:
367.425
SMILES:
CCOc1cccc2n(C)cc(C=c3c(=O)[nH][nH]\c3=c3/snnc3=C)c12
: