Target
Vascular endothelial growth factor receptor 2
Ligand
BDBM50203106
Substrate
Meas. Tech.
ChEMBL_454132 (CHEMBL903321)
IC50
13±n/a nM
Citation
 Tripathy, RGhose, ASingh, JBacon, ERAngeles, TSYang, SXAlbom, MSAimone, LDHerman, JLMallamo, JP 1,2,3-Thiadiazole substituted pyrazolones as potent KDR/VEGFR-2 kinase inhibitors. Bioorg Med Chem Lett 17:1793-8 (2007)  
Target
Name:
Vascular endothelial growth factor receptor 2
Synonyms:
CD_antigen=CD309 Fetal liver kinase 1 (FLK-1) KDR Protein-tyrosine kinase receptor Flk-1 VEGFR-2 VEGFR2 Vascular Endothelial Growth Factor Receptor Kinase 2 Vascular endothelial growth factor receptor 2 (KDR) Vascular endothelial growth factor receptor 2 (VEGFR2) Vascular endothelial growth factor receptor-2 (VEGFR-2)
Type:
Receptor Tyrosine Kinase
Mol. Mass.:
151510.97
Organism:
Homo sapiens (Human)
Description:
P35968
Residue:
1356
  
Inhibitor
Name:
BDBM50203106
Synonyms:
4-((4-methoxy-1-methyl-1H-indol-3-yl)methylene)-3-(1,2,3-thiadiazol-5-yl)-1H-pyrazol-5(4H)-one | CHEMBL250198
Type:
Small organic molecule
Emp. Form.:
C16H13N5O2S
Mol. Mass.:
339.372
SMILES:
COc1cccc2n(C)cc(\C=C3/C(=O)NN=C3c3cnns3)c12
: