Target
Melanin-concentrating hormone receptor 1
Ligand
BDBM50184924
Substrate
Meas. Tech.
ChEMBL_420454 (CHEMBL854904)
Ki
2.7±n/a nM
Citation
 Guo, TGu, HHobbs, DWBusler, DERokosz, LL Discovery of tetralin ureas as potent melanin concentrating hormone 1 receptor antagonists. Bioorg Med Chem Lett 17:1718-21 (2007)  
Target
Name:
Melanin-concentrating hormone receptor 1
Synonyms:
G-protein coupled receptor 24 MCH receptor 1 MCH-R1 MCHR-1 MCHR1_HUMAN Melanin-Concentrating Hormone Receptor 1 (MCH1R) Melanin-concentrating hormone receptor 1 (MCH-1) Melanin-concentrating hormone receptor 1 (MCHR-1) SLC-1 Somatostatin receptor-like protein
Type:
G Protein-Coupled Receptor (GPCR)
Mol. Mass.:
45976.27
Organism:
Homo sapiens (Human)
Description:
Membranes from CHO-K1 cells stably expressing human MCH1R were used in assays.
Residue:
422
  
Inhibitor
Name:
BDBM50184924
Synonyms:
1-((1S,2R,5S)-5-(4-cyanophenyl)bicyclo[3.1.0]hexan-2-yl)-3-(4-fluoro-3-(trifluoromethyl)phenyl)-1-(3-(4-methylpiperazin-1-yl)propyl)urea N-[trans-5-(4-cyanophenyl)bicyclo[3.1.0]hex-2-yl]-N'-[4-fluoro-3-(trifluoromethyl)phenyl)-N-[3-(4-methyl-1-piperazinyl)propyl]-urea
Type:
Small organic molecule
Emp. Form.:
C29H33F4N5O
Mol. Mass.:
543.5988
SMILES:
CN1CCN(CCCN([C@@H]2CC[C@@]3(C[C@H]23)c2ccc(cc2)C#N)C(=O)Nc2ccc(F)c(c2)C(F)(F)F)CC1
: