Target
Melanin-concentrating hormone receptor 1
Ligand
BDBM50203355
Substrate
Meas. Tech.
ChEMBL_420454 (CHEMBL854904)
Ki
4±n/a nM
Citation
 Guo, TGu, HHobbs, DWBusler, DERokosz, LL Discovery of tetralin ureas as potent melanin concentrating hormone 1 receptor antagonists. Bioorg Med Chem Lett 17:1718-21 (2007)  
Target
Name:
Melanin-concentrating hormone receptor 1
Synonyms:
G-protein coupled receptor 24 MCH receptor 1 MCH-R1 MCHR-1 MCHR1_HUMAN Melanin-Concentrating Hormone Receptor 1 (MCH1R) Melanin-concentrating hormone receptor 1 (MCH-1) Melanin-concentrating hormone receptor 1 (MCHR-1) SLC-1 Somatostatin receptor-like protein
Type:
G Protein-Coupled Receptor (GPCR)
Mol. Mass.:
45976.27
Organism:
Homo sapiens (Human)
Description:
Membranes from CHO-K1 cells stably expressing human MCH1R were used in assays.
Residue:
422
  
Inhibitor
Name:
BDBM50203355
Synonyms:
3-(3-chloro-4-fluorophenyl)-1-((1R,3R,6S)-6-(3-cyanophenyl)bicyclo[4.1.0]heptan-3-yl)-1-(3-(4-methylpiperazin-1-yl)propyl)urea | CHEMBL216820
Type:
Small organic molecule
Emp. Form.:
C29H35ClFN5O
Mol. Mass.:
524.073
SMILES:
CN1CCN(CCCN([C@@H]2CC[C@@]3(C[C@@H]3C2)c2cccc(c2)C#N)C(=O)Nc2ccc(F)c(Cl)c2)CC1
: