Target
Metabotropic glutamate receptor 1
Ligand
BDBM50204428
Substrate
Meas. Tech.
ChEMBL_442080 (CHEMBL891221)
IC50
16±n/a nM
Citation
 Di Fabio, RMicheli, FAlvaro, GCavanni, PDonati, DGagliardi, TFontana, GGiovannini, RMaffeis, MMingardi, ATranquillini, MEVitulli, G From pyrroles to 1-oxo-2,3,4,9-tetrahydro-1H-beta-carbolines: a new class of orally bioavailable mGluR1 antagonists. Bioorg Med Chem Lett 17:2254-9 (2007)  
Target
Name:
Metabotropic glutamate receptor 1
Synonyms:
GRM1_RAT Grm1 Metabotropic glutamate receptor Mglur1 metabotropic glutamate 1/5-D metabotropic glutamate receptor 1 isoform alpha precursor
Type:
Enzyme Catalytic Domain
Mol. Mass.:
133240.47
Organism:
RAT
Description:
metabotropic glutamate 1/2 0 RAT::P23385
Residue:
1199
  
Inhibitor
Name:
BDBM50204428
Synonyms:
(S)-4-(3,3-dimethylbutan-2-yl) 2-propyl 3,5-dimethyl-1H-pyrrole-2,4-dicarboxylate | CHEMBL232052
Type:
Small organic molecule
Emp. Form.:
C17H27NO4
Mol. Mass.:
309.4006
SMILES:
CCCOC(=O)c1[nH]c(C)c(C(=O)O[C@@H](C)C(C)(C)C)c1C
: