Target
Adenosine receptor A3
Ligand
BDBM50205280
Substrate
Meas. Tech.
ChEMBL_425911 (CHEMBL907971)
Ki
25±n/a nM
Citation
 Chang, LCvon Frijtag Drabbe Künzel, JKMulder-Krieger, TWesterhout, JSpangenberg, TBrussee, JIjzerman, AP 2,6,8-trisubstituted 1-deazapurines as adenosine receptor antagonists. J Med Chem 50:828-34 (2007)  
Target
Name:
Adenosine receptor A3
Synonyms:
A3 adenosine receptor (hA3) ADORA3 | Adenosine A3 receptor (A3AR)
Type:
G Protein-Coupled Receptor (GPCR)
Mol. Mass.:
36197.32
Organism:
Homo sapiens (Human)
Description:
P0DMS8
Residue:
318
  
Inhibitor
Name:
BDBM50205280
Synonyms:
2,6-diphenyl-8-isobutyl-1-deazapurine LUF-5978
Type:
Small organic molecule
Emp. Form.:
C22H21N3
Mol. Mass.:
327.4222
SMILES:
CC(C)Cc1nc2c(cc(nc2[nH]1)-c1ccccc1)-c1ccccc1
: