Target
Adenosine receptor A2a
Ligand
BDBM50205280
Substrate
Meas. Tech.
ChEMBL_425909 (CHEMBL907969)
Ki
189±n/a nM
Citation
 Chang, LCvon Frijtag Drabbe Künzel, JKMulder-Krieger, TWesterhout, JSpangenberg, TBrussee, JIjzerman, AP 2,6,8-trisubstituted 1-deazapurines as adenosine receptor antagonists. J Med Chem 50:828-34 (2007)  
Target
Name:
Adenosine receptor A2a
Synonyms:
A2A adenosine receptor (hA2A) ADENOSINE A2 ADORA2 Adenosine A2A receptor (A2AAR)
Type:
G Protein-Coupled Receptor (GPCR)
Mol. Mass.:
44716.46
Organism:
Homo sapiens (Human)
Description:
P29274
Residue:
412
  
Inhibitor
Name:
BDBM50205280
Synonyms:
2,6-diphenyl-8-isobutyl-1-deazapurine LUF-5978
Type:
Small organic molecule
Emp. Form.:
C22H21N3
Mol. Mass.:
327.4222
SMILES:
CC(C)Cc1nc2c(cc(nc2[nH]1)-c1ccccc1)-c1ccccc1
: