Target
Cytosolic phospholipase A2
Ligand
BDBM50149408
Substrate
Meas. Tech.
ChEMBL_428330 (CHEMBL917108)
IC50
4400±n/a nM
Citation
 Lee, KLFoley, MAChen, LBehnke, MLLovering, FEKirincich, SJWang, WShim, JTam, SShen, MWKhor, SXu, XGoodwin, DGRamarao, MKNickerson-Nutter, CDonahue, FKu, MSClark, JDMcKew, JC Discovery of Ecopladib, an indole inhibitor of cytosolic phospholipase A2alpha. J Med Chem 50:1380-400 (2007)  
Target
Name:
Cytosolic phospholipase A2
Synonyms:
CPLA2 PA24A_HUMAN PLA2G4A Phospholipase A2 | Phospholipase A2 group IVA
Type:
Protein
Mol. Mass.:
85219.30
Organism:
Homo sapiens (Human)
Description:
P47712
Residue:
749
  
Inhibitor
Name:
BDBM50149408
Synonyms:
4-(2-Oxo-hexadecanoylamino)-butyric acid CHEMBL95190
Type:
Small organic molecule
Emp. Form.:
C20H37NO4
Mol. Mass.:
355.5121
SMILES:
CCCCCCCCCCCCCCC(=O)C(=O)NCCCC(O)=O
: