Target
Muscarinic acetylcholine receptor M4
Ligand
BDBM50206166
Substrate
Meas. Tech.
ChEMBL_454684 (CHEMBL886704)
Ki
4500±n/a nM
Citation
 Suckling, CJMurphy, JAKhalaf, AIZhou, SZLizos, DEvan Nhien, ANYasumatsu, HMcVie, AYoung, LCMcCraw, CWaterman, PGMorris, BJPratt, JAHarvey, AL M4 agonists/5HT7 antagonists with potential as antischizophrenic drugs: serominic compounds. Bioorg Med Chem Lett 17:2649-55 (2007)  
Target
Name:
Muscarinic acetylcholine receptor M4
Synonyms:
ACM4_HUMAN Cholinergic, muscarinic M4 Muscarinic acetylcholine receptor M2 and M4
Type:
Enzyme Catalytic Domain
Mol. Mass.:
53079.31
Organism:
Homo sapiens (Human)
Description:
Cholinergic, muscarinic M4 CHRM4 HUMAN M3::P08173
Residue:
479
  
Inhibitor
Name:
BDBM50206166
Synonyms:
(E)-3-(butylthio)-N-((6,7-dimethoxy-3,4-dihydroisoquinolin-2(1H)-yl)methylene)-2,3-dihydro-1H-inden-5-amine | CHEMBL429644
Type:
Small organic molecule
Emp. Form.:
C25H32N2O2S
Mol. Mass.:
424.599
SMILES:
CCCCSC1CCc2ccc(cc12)\N=C\N1CCc2cc(OC)c(OC)cc2C1
: