Target
5-hydroxytryptamine receptor 7
Ligand
BDBM50206172
Substrate
Meas. Tech.
ChEMBL_454683 (CHEMBL886703)
Ki
9±n/a nM
Citation
 Suckling, CJMurphy, JAKhalaf, AIZhou, SZLizos, DEvan Nhien, ANYasumatsu, HMcVie, AYoung, LCMcCraw, CWaterman, PGMorris, BJPratt, JAHarvey, AL M4 agonists/5HT7 antagonists with potential as antischizophrenic drugs: serominic compounds. Bioorg Med Chem Lett 17:2649-55 (2007)  
Target
Name:
5-hydroxytryptamine receptor 7
Synonyms:
5-HT-7 5-HT7 5-HT7S 5HT7 HTR7 | Serotonin receptor 7
Type:
G Protein-Coupled Receptor (GPCR)
Mol. Mass.:
53573.08
Organism:
Homo sapiens (Human)
Description:
P34969
Residue:
479
  
Inhibitor
Name:
BDBM50206172
Synonyms:
1-(benzo[d][1,3]dioxol-5-ylmethyl)-2,3,4,9-tetrahydro-1H-pyrido[3,4-b]indole CHEMBL328476
Type:
Small organic molecule
Emp. Form.:
C19H18N2O2
Mol. Mass.:
306.3584
SMILES:
C(C1NCCc2c1[nH]c1ccccc21)c1ccc2OCOc2c1
: