Target
D(2) dopamine receptor
Ligand
BDBM50206175
Substrate
Meas. Tech.
ChEMBL_454685 (CHEMBL886705)
Ki
1500±n/a nM
Citation
 Suckling, CJMurphy, JAKhalaf, AIZhou, SZLizos, DEvan Nhien, ANYasumatsu, HMcVie, AYoung, LCMcCraw, CWaterman, PGMorris, BJPratt, JAHarvey, AL M4 agonists/5HT7 antagonists with potential as antischizophrenic drugs: serominic compounds. Bioorg Med Chem Lett 17:2649-55 (2007)  
Target
Name:
D(2) dopamine receptor
Synonyms:
D(2) dopamine receptor DOPAMINE D2 Long DRD2 Dopamine D2 receptor Dopamine D2 receptor (D2R) Dopamine2-like | d2
Type:
Cell-surface receptors
Mol. Mass.:
50647.10
Organism:
Homo sapiens (Human)
Description:
P14416
Residue:
443
  
Inhibitor
Name:
BDBM50206175
Synonyms:
1-(3-methoxybenzyl)-6-methoxy-2,3,4,9-tetrahydro-1H-pyrido[3,4-b]indole | CHEMBL393275
Type:
Small organic molecule
Emp. Form.:
C20H22N2O2
Mol. Mass.:
322.4009
SMILES:
COc1cccc(CC2NCCc3c2[nH]c2ccc(OC)cc32)c1
: